{"text_format":"1","workbook":"xlsx","n_sheets":33,"sheets":["Instructions","GSNSW Codes","General Information","Drillhole Locations (SL4)","Drillhole Surveys (DS4)","Logging Data Dictionary (LDD4)","Drillhole Logging (DL4)","Drillhole Alteration","Drillhole Mag Susc","Drillhole Vein","Drillhole Recovery","Drillhole Weathering","Drillhole Other","Drillhole Geochemistry (DG4)","Surface Geochemistry (SG4)","XRF Surface Geochem (SG4_PXRF)","XRF Downhole Geochem (DG4_PXRF)","Lookups","FileNames","SL4Print","DS4Print","LDD4Print","DL4Print","DL4aPrint","DL4bPrint","DL4cPrint","DL4dPrint","DL4ePrint","DL4fPrint","DG4Print","SG4Print","SG4_PXRFPrint","DG4_PXRFPrint"],"not_rendered":{"charts":0,"images":19,"macros":1,"external_links":0,"defined_names":16,"comments":8,"pivot_tables":0},"unopened":[],"bounds":{"document_bytes":16777216,"sheet_cells":100000,"rows_first":2000,"rows_last":500,"rows_between":2000,"halvings":0,"cell_chars":16384,"cell_head_chars":4096},"cells_cut":0,"cells_raw":0,"read":"whole","date_system":"1900"}

{"sheet":"Instructions","index":0,"n_rows":124,"n_cols":3,"rows_kept":124,"cut":false,"hidden":false,"merged":[[123,1,123,11],[109,1,109,11],[92,2,92,11],[93,2,93,11],[95,2,95,10],[96,2,96,10],[97,2,97,11],[99,2,99,11],[1,1,1,12],[38,1,38,11],[80,1,80,11],[81,1,81,11],[83,1,83,11],[3,1,3,11],[5,1,5,11],[9,1,9,11],[13,1,13,11],[17,1,17,10],[79,1,79,11]]}
[]
[null,"INSTRUCTIONS"]
[]
[]
[]
[null,"Template overview:"]
{"$rows_left_out":119}
{"sheet":"GSNSW Codes","index":1,"n_rows":201,"n_cols":11,"rows_kept":201,"cut":false,"hidden":false,"merged":[[1,1,1,2],[1,4,1,6],[1,8,1,10],[59,14,59,15],[60,14,60,15],[44,1,44,2],[15,1,15,2],[21,1,21,2],[30,1,30,2],[31,1,31,2],[43,1,43,2],[72,14,72,15],[57,8,57,9],[63,8,63,9],[57,1,57,2],[63,1,63,2],[71,14,71,15]]}
[]
[null,"Drill Codes for Sheet SL4",null,null,"Lab Codes for Assays",null,null,null,"Example of Logging Classification for DL4 Sheets"]
[null,"ACORE","Air core",null,"AAECUNK","Australian Atomic Energy Commision","Unknown",null,"Column Type","Column Name","Column Description"]
[null,"AUGER","Auger, mechanical",null,"AALCOB","Australian Assay Laboratories (AAL)","Cobar, NSW",null,"ALTERATION","ALT_MIN","alteration mineral"]
[null,"DD","Diamond drill hole",null,"AALDRAKE","Australian Assay Laboratories (AAL)","Drake, NSW",null,"ALTERATION","ALT_INT","alteration intensity"]
[null,"PCDD","Pre-collared drillhole (various methods) with Diamond core tail.  ",null,"AALORAN","Australian Assay Laboratories (AAL)","Orange, NSW",null,"ALTERATION","ALT_STY","alteration style"]
{"$rows_left_out":196}
{"sheet":"General Information","index":2,"n_rows":397,"n_cols":13,"rows_kept":397,"cut":false,"hidden":false,"merged":[[374,8,374,11],[375,2,375,8],[376,2,376,11],[155,2,155,11],[158,2,158,11],[156,2,156,11],[159,2,159,11],[258,2,258,4],[258,6,258,7],[258,9,258,11],[219,2,219,8],[220,2,220,11],[251,2,251,4],[249,1,249,12],[299,1,299,12],[301,6,301,7],[357,6,357,7],[357,9,357,11],[349,1,349,12],[307,2,307,4],[307,6,307,7],[307,9,307,11],[324,8,324,11],[325,2,325,8],[3,2,3,4],[1,1,1,12],[3,6,3,7],[49,1,49,12],[51,2,51,4],[3,9,3,10],[5,9,5,10],[218,8,218,11],[101,6,101,7],[99,1,99,12],[101,2,101,4],[199,1,199,12],[201,2,201,4],[201,6,201,7],[201,9,201,11],[203,3,203,4],[204,3,204,4],[202,3,202,4],[205,3,205,4],[206,3,206,4],[207,3,207,4],[208,3,208,4],[209,3,209,4],[60,2,60,4],[51,6,51,11],[53,8,53,11],[54,8,54,11],[55,8,55,11],[56,8,56,11],[57,8,57,11],[58,8,58,11],[59,8,59,11],[60,8,60,11],[61,8,61,11],[62,8,62,11],[63,8,63,11],[149,1,149,12],[64,2,64,8],[65,2,65,11],[108,8,108,11],[109,2,109,8],[110,2,110,11],[275,8,275,11],[276,2,276,8],[277,2,277,11],[261,3,261,4],[262,3,262,4],[265,3,265,4],[263,3,263,4],[264,3,264,4],[215,3,215,4],[216,3,216,4],[217,3,217,4],[259,3,259,4],[260,3,260,4],[271,3,271,4],[272,3,272,4],[273,3,273,4],[274,3,274,4],[308,3,308,4],[266,3,266,4],[267,3,267,4],[268,3,268,4],[269,3,269,4],[270,3,270,4],[315,3,315,4],[316,3,316,4],[210,3,210,4],[211,3,211,4],[212,3,212,4],[213,3,213,4],[214,3,214,4],[301,2,301,4],[317,3,317,4],[318,3,318,4],[319,3,319,4],[309,3,309,4],[311,3,311,4],[312,3,312,4],[313,3,313,4],[314,3,314,4],[359,3,359,4],[310,3,310,4],[360,3,360,4],[361,3,361,4],[362,3,362,4],[363,3,363,4],[320,3,320,4],[321,3,321,4],[322,3,322,4],[323,3,323,4],[358,3,358,4],[357,2,357,4],[326,2,326,11],[351,6,351,7],[369,3,369,4],[370,3,370,4],[371,3,371,4],[372,3,372,4],[373,3,373,4],[364,3,364,4],[365,3,365,4],[366,3,366,4],[367,3,367,4],[368,3,368,4]]}
[]
[null,"GENERAL REPORT INFORMATION"]
[null,null,null,null,null,null,null,null,null,null,null,null,"Version 4.6 18/3/2024"]
[null,null,"Report Details",null,null,null,"Data Sheets Required",null,null,"Help on using this template"]
[null,null,"Report Type*",null,null,null,null,"Drillhole Locations"]
[null,null,"Reporting Period End Date*",null,null,null,null,"Drillhole Surveys",null,"Link to exploration reporting guidelines"]
{"$rows_left_out":392}
{"sheet":"Drillhole Locations (SL4)","index":3,"n_rows":4,"n_cols":18,"rows_kept":4,"cut":false,"hidden":true,"merged":[]}
[null,null,null,"DRILLHOLE LOCATIONS (SL4)"]
[null,null,null,"Mandatory fields are marked with an asterisk (*). See column comments (red flags) for additional information"]
[]
["ERROR",null,"Hole ID*",{"$f":"IF('General Information'!$E$53=\"\",\"East Co-ord*\",VLOOKUP('General Information'!$E$53,Lookups!$C$2:$I$16,5,FALSE))","v":"East Co-ord*"},{"$f":"IF('General Information'!$E$53=\"\",\"North Co-ord*\",VLOOKUP('General Information'!$E$53,Lookups!$C$2:$I$16,6,FALSE))","v":"North Co-ord*"},"Elevation*","Depth*","Drill Code*","Dip*","Azimuth*","Date Drilled*","Surv Method*","Surv Company","Drilling Company*","Prospect","BOH Lith","BOH Lith desc","Comments"]

{"sheet":"Drillhole Surveys (DS4)","index":4,"n_rows":4,"n_cols":12,"rows_kept":4,"cut":false,"hidden":true,"merged":[[2,5,2,7]]}
[null,null,null,"DRILLHOLE SURVEYS (DS4)"]
[null,null,null,"Mandatory fields are marked with an asterisk (*). See column comments (red flags) for additional information"]
[null,null,null,null,null,"Azimuth*"]
["ERROR",null,"Hole ID*","Depth*","Inclination*","Azi MAG","Azi UTM","Azi TRUE","Survey Method*","Survey Company","Priority","Comments"]

{"sheet":"Logging Data Dictionary (LDD4)","index":5,"n_rows":4,"n_cols":5,"rows_kept":4,"cut":false,"hidden":true,"merged":[]}
[null,null,"LOGGING DATA DICTIONARY (LDD4)"]
[null,null,"Mandatory fields are marked with an asterisk (*). See column comments (red flags) for additional information"]
[]
["ERROR","Column type*","Column Name*","Code*","Description*"]

{"sheet":"Drillhole Logging (DL4)","index":6,"n_rows":4,"n_cols":9,"rows_kept":4,"cut":false,"hidden":true,"merged":[[1,8,1,11]]}
[null,null,"DRILLHOLE LOGGING (DL4)"]
[null,null,"Mandatory fields are marked with an asterisk (*). See column comments (red flags) for additional information",null,null,null,null,null,"Add columns for additional drillhole attributes logged (interval data) eg: colour, grainsize etc"]
[null,null,null,null,null,null,"Units"]
["ERROR","Hole_ID*","From*","To*","Log Date","Comments","Attribute*","Lithology"]

{"sheet":"Drillhole Alteration","index":7,"n_rows":4,"n_cols":9,"rows_kept":4,"cut":false,"hidden":true,"merged":[[1,8,1,11]]}
[null,null,"DRILLHOLE ALTERATION"]
[null,null,"Mandatory fields are marked with an asterisk (*). See column comments (red flags) for additional information",null,null,null,null,null,"Add columns for additional drillhole attributes logged (interval data) eg: colour, grainsize etc"]
[null,null,null,null,null,null,"Units"]
["ERROR","Hole_ID*","From*","To*","Log Date","Comments","Attribute*"]

{"sheet":"Drillhole Mag Susc","index":8,"n_rows":4,"n_cols":9,"rows_kept":4,"cut":false,"hidden":true,"merged":[[1,8,1,11]]}
[null,null,"DRILLHOLE MAG SUSC"]
[null,null,"Mandatory fields are marked with an asterisk (*). See column comments (red flags) for additional information",null,null,null,null,null,"Add columns for additional drillhole attributes logged (interval data) eg: colour, grainsize etc"]
[null,null,null,null,null,null,"Units"]
["ERROR","Hole_ID*","From*","To*","Log Date","Comments","Attribute*"]

{"sheet":"Drillhole Vein","index":9,"n_rows":4,"n_cols":9,"rows_kept":4,"cut":false,"hidden":true,"merged":[[1,8,1,11]]}
[null,null,"DRILLHOLE VEIN"]
[null,null," Mandatory fields are marked with an asterisk (*). See column comments (red flags) for additional information",null,null,null,null,null,"Add columns for additional drillhole attributes logged (interval data) eg: colour, grainsize etc"]
[null,null,null,null,null,null,"Units"]
["ERROR","Hole_ID*","From*","To*","Log Date","Comments","Attribute*"]

{"sheet":"Drillhole Recovery","index":10,"n_rows":4,"n_cols":9,"rows_kept":4,"cut":false,"hidden":true,"merged":[[1,8,1,11]]}
[null,null,"DRILLHOLE RECOVERY"]
[null,null," Mandatory fields are marked with an asterisk (*). See column comments (red flags) for additional information",null,null,null,null,null,"Add columns for additional drillhole attributes logged (interval data) eg: colour, grainsize etc"]
[null,null,null,null,null,null,"Units"]
["ERROR","Hole_ID*","From*","To*","Log Date","Comments","Attribute*"]

{"sheet":"Drillhole Weathering","index":11,"n_rows":4,"n_cols":9,"rows_kept":4,"cut":false,"hidden":true,"merged":[[1,8,1,11]]}
[null,null,"DRILLHOLE WEATHERING"]
[null,null," Mandatory fields are marked with an asterisk (*). See column comments (red flags) for additional information",null,null,null,null,null,"Add columns for additional drillhole attributes logged (interval data) eg: colour, grainsize etc"]
[null,null,null,null,null,null,"Units"]
["ERROR","Hole_ID*","From*","To*","Log Date","Comments","Attribute*"]

{"sheet":"Drillhole Other","index":12,"n_rows":4,"n_cols":9,"rows_kept":4,"cut":false,"hidden":true,"merged":[[1,8,1,11]]}
[null,null,"DRILLHOLE OTHER"]
[null,null," Mandatory fields are marked with an asterisk (*). See column comments (red flags) for additional information",null,null,null,null,null,"Add columns for additional drillhole attributes logged (interval data) eg: colour, grainsize etc"]
[null,null,null,null,null,null,"Units"]
["ERROR","Hole_ID*","From*","To*","Log Date","Comments","Attribute*"]

{"sheet":"Drillhole Geochemistry (DG4)","index":13,"n_rows":6,"n_cols":17,"rows_kept":6,"cut":false,"hidden":true,"merged":[]}
[null,null,null,null,null,null,null,null,null,null,null,null,null,null,null,null,"Element*"]
[null,null,null,null,null,null,null,null,null,null,null,null,null,null,null,null,"Unit of Measure*"]
[null,null,null,null,null,null,null,null,null,"Mandatory fields are marked with an asterisk (*). See column comments (red flags) for additional information",null,null,null,null,null,null,"Assay Code*"]
[null,null,null,null,null,null,null,null,null,null,null,null,null,null,null,null,"Lower detection limit*"]
[">5",">5",">5",">5",null,null,null,null,null,null,null,null,null,null,null,null,"Upper detection limit"]
["ERROR",null,null,null,null,null,null,null,"Hole_ID*","Sample ID*","From*","To*","Sample code*","Job Number","Sample Date","Comments","Assay company code*"]
{"$rows_left_out":1}
{"sheet":"Surface Geochemistry (SG4)","index":14,"n_rows":6,"n_cols":17,"rows_kept":6,"cut":false,"hidden":true,"merged":[]}
[null,null,null,null,null,null,null,null,null,null,null,null,null,null,null,null,"Element*"]
[null,null,null,null,null,null,null,null,null,null,null,null,null,null,null,null,"Unit of Measure*"]
[null,null,null,null,null,null,"Mandatory fields are marked with an asterisk (*). See column comments (red flags) for additional information",null,null,null,null,null,null,null,null,null,"Assay Code*"]
[null,null,null,null,null,null,null,null,null,null,null,null,null,null,null,null,"Lower detection limit*"]
[null,null,null,null,null,null,null,null,null,null,null,null,null,null,null,null,"Upper detection limit"]
["ERROR",null,null,null,null,"SampleID*","Sample Code*","Lithology","Lith Description",{"$f":"IF('General Information'!$E$253=\"\",\"East Co-ord*\",VLOOKUP('General Information'!$E$253,Lookups!$C$2:$I$16,5,FALSE))","v":"East Co-ord*"},{"$f":"IF('General Information'!$E$253=\"\",\"North Co-ord*\",VLOOKUP('General Information'!$E$253,Lookups!$C$2:$I$16,6,FALSE))","v":"North Co-ord*"},"Elevation","Prospect","Job Number","Sample Date","Comments","Assay company code*"]
{"$rows_left_out":1}
{"sheet":"XRF Surface Geochem (SG4_PXRF)","index":15,"n_rows":5,"n_cols":17,"rows_kept":5,"cut":false,"hidden":true,"merged":[]}
[null,null,null,null,null,null,null,null,null,null,null,null,null,null,null,null,"Element*"]
[null,null,null,null,null,null,null,null,null,null,null,null,null,null,null,null,"Unit of Measure*"]
[null,null,null,null,"Mandatory fields are marked with an asterisk (*). See column comments (red flags) for additional information",null,null,null,null,null,null,null,null,null,null,null,"Assay Code*"]
[null,null,null,null,null,null,null,null,null,null,null,null,null,null,null,null,"Lower detection limit"]
["ERROR",null,null,"SampleID*",{"$f":"IF('General Information'!$E$303=\"\",\"East Co-ord*\",VLOOKUP('General Information'!$E$303,Lookups!$C$2:$I$16,5,FALSE))","v":"East Co-ord*"},{"$f":"IF('General Information'!$E$303=\"\",\"North Co-ord*\",VLOOKUP('General Information'!$E$303,Lookups!$C$2:$I$16,6,FALSE))","v":"North Co-ord*"},"Reading No.","Sequence","Mode","Time Elapsed","Duration/Beam Time","Barrier","Sample Code*","Job Number","Sample Date","Comments","Assay company code*"]

{"sheet":"XRF Downhole Geochem (DG4_PXRF)","index":16,"n_rows":5,"n_cols":17,"rows_kept":5,"cut":false,"hidden":true,"merged":[]}
[null,null,null,null,null,null,null,null,null,null,null,null,null,null,null,null,"Element*"]
[null,null,null,null,null,null,null,null,null,null,null,null,null,null,null,null,"Unit of Measure*"]
[null,null,null," Mandatory fields are marked with an asterisk (*). See column comments (red flags) for additional information",null,null,null,null,null,null,null,null,null,null,null,null,"Assay Code*"]
[null,null,null,null,null,null,null,null,null,null,null,null,null,null,null,null,"Lower detection limit"]
["ERROR",null,"Hole_ID*","Sample ID*","From*","To*","Reading No.","Sequence","Mode","Time Elapsed","Duration/Beam Time","Barrier","Sample code*","Job Number","Sample Date","Comments","Assay company code*"]

{"sheet":"Lookups","index":17,"n_rows":200,"n_cols":36,"rows_kept":200,"cut":false,"hidden":true,"merged":[]}
["Report Type",null,"EPSGs","Geodetic Datum","Coordinate system","Projection","Easting","Northing","UTM zone",null,"Units (azimuth)",null,null,null,"Drill codes","Surv method (location)",null,"Surv method (downhole)",null,"DH samp codes",null,"Surf samp codes",null,"Barrier",null,"Units (assays)",null,"Lab Codes",null,null,null,null,null,null,{"$f":"'General Information'!L204","v":0},{"$f":"IFERROR(VLOOKUP(AI1, $AD$2:$AE$200, 2, FALSE), \"\")","v":""}]
["Annual (A)",null,"Projected: GDA94/MGA zone 54 (EPSG 28354 )","GDA94","Projected","UTM MGA","MGA_E*","MGA_N*",54,null,"Degrees_MAG",null,null,null,"ACORE","GPS",null,"PLAN",null,"CHIPS",null,"COSTEAN",null,"PVC",null,"ppm",null,"AAECUNK",null,"Australian Atomic Energy Commision, Unknown","AAECUNK",null,null,null,{"$f":"'General Information'!L205","v":0},{"$f":"IFERROR(VLOOKUP(AI2, $AD$2:$AE$200, 2, FALSE), \"\")","v":""}]
["Final (F)",null,"Projected: GDA94/MGA zone 55 (EPSG 28355)","GDA94","Projected","UTM MGA","MGA_E*","MGA_N*",55,null,"Degrees_UTM",null,null,null,"AUGER","DGPS",null,"ESTIMATE",null,"CHIPS_AC",null,"DRILLSPOIL",null,"NONE",null,"ppb",null,"AALCOB",null,"Australian Assay Laboratories (AAL), Cobar, NSW","AALCOB",null,null,null,{"$f":"'General Information'!L206","v":0},""]
["Relinquishment (R)",null,"Projected: GDA94/MGA zone 56 (EPSG 28356)","GDA94","Projected","UTM MGA","MGA_E*","MGA_N*",56,null,"Degrees_TRUE",null,null,null,"DD","UNK",null,"GYRO",null,"CHIPS_OH",null,"FLOAT",null,"CALICO",null,"g/bcm",null,"AALDRAKE",null,"Australian Assay Laboratories (AAL), Drake, NSW","AALDRAKE",null,null,null,{"$f":"'General Information'!L207","v":0},""]
["Annual and Final (F)",null,"Projected: GDA94/MGA zone 57 (EPSG 28357)","GDA94","Projected","UTM MGA","MGA_E*","MGA_N*",57,null,null,null,null,null,"PCDD","ESTIMATE",null,"SINGLE",null,"CHIPS_RC",null,"LAG",null,"FILM",null,"pct",null,"AALORAN",null,"Australian Assay Laboratories (AAL), Orange, NSW","AALORAN",null,null,null,{"$f":"'General Information'!L208","v":0},""]
[null,null,"Projected: GDA2020/MGA zone 54 (EPSG 7854)","GDA2020","Projected","UTM MGA","MGA_E*","MGA_N*",54,null,null,null,null,null,"PERC",null,null,"MULTI",null,"CORE",null,"MINESPOIL",null,null,null,"kgs",null,"AALPER",null,"Australian Assay Laboratories (AAL), Perth, WA","AALPER",null,null,null,{"$f":"'General Information'!L209","v":0},""]
{"$rows_left_out":195}
{"sheet":"FileNames","index":18,"n_rows":42,"n_cols":16,"rows_kept":42,"cut":false,"hidden":true,"merged":[]}
[{"$f":"IF('General Information'!E5=\"Annual (A)\", \"A\", IF('General Information'!E5=\"Final (F)\", \"F\", IF('General Information'!E5=\"Relinquishment (R)\", \"R\", \"\")))","v":""},null,null,null,"Cross Sheets"]
[{"$f":"TEXT('General Information'!E6,\"YYYYMM\")","v":"190001"}]
[{"$f":"'General Information'!E7","v":0}]
[{"$f":"_xlfn.CONCAT(A3,\"_\",A2,\"_\",A1)","v":"0_190001_"},null,null,null,"Drilling/svy/dh geo has this:",null,null,null,"code","active?","code",null,"full name",null,null,"Cross Data"]
[null,null,null,null,"Location_data_file","EL4242_201109_A_12_DrillCollars.txt ",null,"Location",{"$f":"$A$4","v":"0_190001_"},null,"LOC(SL4)",{"$f":"0+J5","v":0},{"$f":"_xlfn.CONCAT(I5, \"_\", TEXT(L5, \"00\"), \"_\", K5, \".csv\")","v":"0_190001__00_LOC(SL4).csv"}]
[null,null,null,null,"Downhole_lithology_data_file","EL4242_201109_A_13_lithology.txt ",null,"DH svy",{"$f":"$A$4","v":"0_190001_"},1,"DH_SVY(DS4)",{"$f":"L5+J6","v":1},{"$f":"_xlfn.CONCAT(I6, \"_\", TEXT(L6, \"00\"), \"_\", K6, \".csv\")","v":"0_190001__01_DH_SVY(DS4).csv"}]
{"$rows_left_out":37}
{"sheet":"SL4Print","index":19,"n_rows":34,"n_cols":17,"rows_kept":34,"cut":false,"hidden":true,"merged":[]}
["H0001","Report_Type",{"$f":"IF('General Information'!E5=\"Annual (A)\",\"A\",IF('General Information'!E5=\"Final (F)\",\"F\",IF('General Information'!E5=\"Annual and Final (F)\",\"F\",IF('General Information'!E5=\"Relinquishment (R)\",\"R\",\"\"))))","v":""}]
["H0002","Version",4.5999999999999996]
["H0003","Date_Generated"]
["H0004","Reporting_period_end_date"]
["H0005","State","NSW"]
["H0100","Tenement_no"]
{"$rows_left_out":29}
{"sheet":"DS4Print","index":20,"n_rows":26,"n_cols":11,"rows_kept":26,"cut":false,"hidden":true,"merged":[]}
["H0001","Report_Type",{"$f":"IF('General Information'!E5=\"Annual (A)\",\"A\",IF('General Information'!E5=\"Final (F)\",\"F\",IF('General Information'!E5=\"Annual and Final (F)\",\"F\",IF('General Information'!E5=\"Relinquishment (R)\",\"R\",\"\"))))","v":""}]
["H0002","Version",4.5999999999999996]
["H0003","Date_Generated"]
["H0004","Reporting_period_end_date"]
["H0005","State","NSW"]
["H0100","Tenement_no"]
{"$rows_left_out":21}
{"sheet":"LDD4Print","index":21,"n_rows":12,"n_cols":5,"rows_kept":12,"cut":false,"hidden":true,"merged":[]}
["H0001","Report_Type",{"$f":"IF('General Information'!E5=\"Annual (A)\",\"A\",IF('General Information'!E5=\"Final (F)\",\"F\",IF('General Information'!E5=\"Annual and Final (F)\",\"F\",IF('General Information'!E5=\"Relinquishment (R)\",\"R\",\"\"))))","v":""}]
["H0002","Version",4.5999999999999996]
["H0003","Date_generated"]
["H0004","Reporting_period_end_date"]
["H0005","State","NSW"]
["H0100","Tenement_no"]
{"$rows_left_out":7}
{"sheet":"DL4Print","index":22,"n_rows":28,"n_cols":52,"rows_kept":28,"cut":false,"hidden":true,"merged":[]}
["H0001","Report_Type",{"$f":"IF('General Information'!E5=\"Annual (A)\",\"A\",IF('General Information'!E5=\"Final (F)\",\"F\",IF('General Information'!E5=\"Annual and Final (F)\",\"F\",IF('General Information'!E5=\"Relinquishment (R)\",\"R\",\"\"))))","v":""}]
["H0002","Version",4.5999999999999996]
["H0003","Date_generated"]
["H0004","Reporting_period_end_date"]
["H0005","State","NSW"]
["H0100","Tenement_no"]
{"$rows_left_out":23}
{"sheet":"DL4aPrint","index":23,"n_rows":28,"n_cols":52,"rows_kept":28,"cut":false,"hidden":true,"merged":[]}
["H0001","Report_Type",{"$f":"IF('General Information'!E5=\"Annual (A)\",\"A\",IF('General Information'!E5=\"Final (F)\",\"F\",IF('General Information'!E5=\"Annual and Final (F)\",\"F\",IF('General Information'!E5=\"Relinquishment (R)\",\"R\",\"\"))))","v":""}]
["H0002","Version",4.5999999999999996]
["H0003","Date_generated"]
["H0004","Reporting_period_end_date"]
["H0005","State","NSW"]
["H0100","Tenement_no"]
{"$rows_left_out":23}
{"sheet":"DL4bPrint","index":24,"n_rows":28,"n_cols":52,"rows_kept":28,"cut":false,"hidden":true,"merged":[]}
["H0001","Report_Type",{"$f":"IF('General Information'!E5=\"Annual (A)\",\"A\",IF('General Information'!E5=\"Final (F)\",\"F\",IF('General Information'!E5=\"Annual and Final (F)\",\"F\",IF('General Information'!E5=\"Relinquishment (R)\",\"R\",\"\"))))","v":""}]
["H0002","Version",4.5999999999999996]
["H0003","Date_generated"]
["H0004","Reporting_period_end_date"]
["H0005","State","NSW"]
["H0100","Tenement_no"]
{"$rows_left_out":23}
{"sheet":"DL4cPrint","index":25,"n_rows":28,"n_cols":6,"rows_kept":28,"cut":false,"hidden":true,"merged":[]}
["H0001","Report_Type",{"$f":"IF('General Information'!E5=\"Annual (A)\",\"A\",IF('General Information'!E5=\"Final (F)\",\"F\",IF('General Information'!E5=\"Annual and Final (F)\",\"F\",IF('General Information'!E5=\"Relinquishment (R)\",\"R\",\"\"))))","v":""}]
["H0002","Version",4.5999999999999996]
["H0003","Date_generated"]
["H0004","Reporting_period_end_date"]
["H0005","State","NSW"]
["H0100","Tenement_no"]
{"$rows_left_out":23}
{"sheet":"DL4dPrint","index":26,"n_rows":28,"n_cols":6,"rows_kept":28,"cut":false,"hidden":true,"merged":[]}
["H0001","Report_Type",{"$f":"IF('General Information'!E5=\"Annual (A)\",\"A\",IF('General Information'!E5=\"Final (F)\",\"F\",IF('General Information'!E5=\"Annual and Final (F)\",\"F\",IF('General Information'!E5=\"Relinquishment (R)\",\"R\",\"\"))))","v":""}]
["H0002","Version",4.5999999999999996]
["H0003","Date_generated"]
["H0004","Reporting_period_end_date"]
["H0005","State","NSW"]
["H0100","Tenement_no"]
{"$rows_left_out":23}
{"sheet":"DL4ePrint","index":27,"n_rows":28,"n_cols":6,"rows_kept":28,"cut":false,"hidden":true,"merged":[]}
["H0001","Report_Type",{"$f":"IF('General Information'!E5=\"Annual (A)\",\"A\",IF('General Information'!E5=\"Final (F)\",\"F\",IF('General Information'!E5=\"Annual and Final (F)\",\"F\",IF('General Information'!E5=\"Relinquishment (R)\",\"R\",\"\"))))","v":""}]
["H0002","Version",4.5999999999999996]
["H0003","Date_generated"]
["H0004","Reporting_period_end_date"]
["H0005","State","NSW"]
["H0100","Tenement_no"]
{"$rows_left_out":23}
{"sheet":"DL4fPrint","index":28,"n_rows":28,"n_cols":6,"rows_kept":28,"cut":false,"hidden":true,"merged":[]}
["H0001","Report_Type",{"$f":"IF('General Information'!E5=\"Annual (A)\",\"A\",IF('General Information'!E5=\"Final (F)\",\"F\",IF('General Information'!E5=\"Annual and Final (F)\",\"F\",IF('General Information'!E5=\"Relinquishment (R)\",\"R\",\"\"))))","v":""}]
["H0002","Version",4.5999999999999996]
["H0003","Date_generated"]
["H0004","Reporting_period_end_date"]
["H0005","State","NSW"]
["H0100","Tenement_no"]
{"$rows_left_out":23}
{"sheet":"DG4Print","index":29,"n_rows":35,"n_cols":17,"rows_kept":35,"cut":false,"hidden":true,"merged":[]}
["H0001","Report_Type",{"$f":"IF('General Information'!E5=\"Annual (A)\",\"A\",IF('General Information'!E5=\"Final (F)\",\"F\",IF('General Information'!E5=\"Annual and Final (F)\",\"F\",IF('General Information'!E5=\"Relinquishment (R)\",\"R\",\"\"))))","v":""}]
["H0002","Version",4.5999999999999996]
["H0003","Date_Generated"]
["H0004","Reporting_period_end_date"]
["H0005","State","NSW"]
["H0100","Tenement_no"]
{"$rows_left_out":30}
{"sheet":"SG4Print","index":30,"n_rows":41,"n_cols":17,"rows_kept":41,"cut":false,"hidden":true,"merged":[]}
["H0001","Report_Type",{"$f":"IF('General Information'!E5=\"Annual (A)\",\"A\",IF('General Information'!E5=\"Final (F)\",\"F\",IF('General Information'!E5=\"Annual and Final (F)\",\"F\",IF('General Information'!E5=\"Relinquishment (R)\",\"R\",\"\"))))","v":""}]
["H0002","Version",4.5999999999999996]
["H0003","Date_Generated"]
["H0004","Reporting_period_end_date"]
["H0005","State","NSW"]
["H0100","Tenement_no"]
{"$rows_left_out":36}
{"sheet":"SG4_PXRFPrint","index":31,"n_rows":42,"n_cols":17,"rows_kept":42,"cut":false,"hidden":true,"merged":[]}
["H0001","Report_Type",{"$f":"IF('General Information'!E5=\"Annual (A)\",\"A\",IF('General Information'!E5=\"Final (F)\",\"F\",IF('General Information'!E5=\"Annual and Final (F)\",\"F\",IF('General Information'!E5=\"Relinquishment (R)\",\"R\",\"\"))))","v":""}]
["H0002","Version",4.5999999999999996]
["H0003","Date_Generated"]
["H0004","Reporting_Period_end_date"]
["H0005","State","NSW"]
["H0100","Tenement_no"]
{"$rows_left_out":37}
{"sheet":"DG4_PXRFPrint","index":32,"n_rows":38,"n_cols":17,"rows_kept":38,"cut":false,"hidden":true,"merged":[]}
["H0001","Report_Type",{"$f":"IF('General Information'!E5=\"Annual (A)\",\"A\",IF('General Information'!E5=\"Final (F)\",\"F\",IF('General Information'!E5=\"Annual and Final (F)\",\"F\",IF('General Information'!E5=\"Relinquishment (R)\",\"R\",\"\"))))","v":""}]
["H0002","Version",4.5999999999999996]
["H0003","Date_Generated"]
["H0004","Reporting_Period_end_date"]
["H0005","State","NSW"]
["H0100","Tenement_no"]
{"$rows_left_out":32}